{"text_format":"1","workbook":"xlsx","n_sheets":9,"sheets":["Pie Chart","SNAP","WIC","School Meals","Summer Meals","Feeding America Food Bank","Other Sources","Second Helpings","Charitable Response"],"not_rendered":{"charts":1,"images":1,"macros":1,"external_links":0,"defined_names":4,"comments":3,"pivot_tables":0},"unopened":[],"bounds":{"document_bytes":16777216,"sheet_cells":100000,"rows_first":2000,"rows_last":500,"rows_between":2000,"halvings":0,"cell_chars":16384,"cell_head_chars":4096},"cells_cut":0,"cells_raw":0,"read":"whole","date_system":"1900"}

{"sheet":"Pie Chart","index":0,"n_rows":31,"n_cols":15,"rows_kept":31,"cut":false,"hidden":false,"merged":[[16,10,16,13],[16,8,16,9]]}
["Choose County:","Marion","Source of Meals","Meal Equivalents"]
[null,null,"SNAP",{"$f":"INDEX(SNAP!S:S,MATCH($B$1,SNAP!P:P,0))","v":164327510.04016063}]
[null,null,"F&R School/Summer",{"$f":"INDEX('School Meals'!F:F,MATCH($B$1,'School Meals'!A:A,0))+INDEX('Summer Meals'!E:E,MATCH($B$1,'Summer Meals'!A:A,0))","v":25324274}]
[null,null,"FA Food Bank-non-Federal",{"$f":"INDEX('Feeding America Food Bank'!I:I,MATCH($B$1,'Feeding America Food Bank'!B:B,0))","v":9140576.6666666679}]
[null,null,"FA Food Bank-Federal",{"$f":"INDEX('Feeding America Food Bank'!H:H,MATCH($B$1,'Feeding America Food Bank'!B:B,0))","v":2957445.8333333335}]
[null,null,"WIC",{"$f":"INDEX(WIC!D:D,MATCH($B$1,WIC!A:A,0))","v":10887103.468875501}]
[null,null,"Charitable Response",{"$f":"INDEX('Charitable Response'!F:F,MATCH($B$1,'Charitable Response'!A:A,0))","v":4657738.6625000006}]
[null,null,"Other Private",{"$f":"INDEX('Other Sources'!B:B,MATCH($B$1,'Other Sources'!A:A,0))","v":6196140.2666666666}]
[null,null,"Other Fed",{"$f":"INDEX('Other Sources'!C:C,MATCH($B$1,'Other Sources'!A:A,0))","v":282041.89999999997}]
[null,null,"-------------------------------------------------------------"]
[null,null,"2012 Total",{"$f":"SUM(D2:D9)","v":223772830.8382028}]
[]
[]
[]
[]
[]
[null,null,"Federal",{"$f":"D2+D3+D5+D6+D9","v":203778375.24236947},null,{"$f":"D17/D11","v":0.91064842179035499},null,null,"County:",null,{"$f":"B1","v":"Marion"}]
[null,null,"Non-Federal",{"$f":"D4+D7+D8","v":19994455.595833335},null,{"$f":"D18/D11","v":8.9351578209644983E-2}]
[]
[]
{"$rows_left_out":12}
{"sheet":"SNAP","index":1,"n_rows":94,"n_cols":19,"rows_kept":94,"cut":false,"hidden":true,"merged":[]}
["County","Jan","Feb","Mar","Apr","May","Jun","Jul","Aug","Sept","Oct","Nov","Dec","Total",null,null,"Dollars","Pounds","Meals"]
["Adams",381.3,383,387.1,378.5,380.1,388.6,402.4,410.3,381.5,384,387.8,386.2,{"$f":"SUM(B2:M2)","v":4650.8},null,{"$f":"A2","v":"Adams"},{"$f":"N2*1000","v":4650800},{"$f":"Q2/'Pie Chart'!$O$30","v":2801686.7469879519},{"$f":"R2/'Pie Chart'!$O$31","v":2334738.9558232934}]
["Allen",7225.5,7215.8,7234.6,7184.5,7239,7231.5,8968.2000000000007,7383.1,7363.6,7392.3,7365.1,7372.9,89176.1,null,{"$f":"A3","v":"Allen"},{"$f":"N3*1000","v":89176100},{"$f":"Q3/'Pie Chart'!$O$30","v":53720542.1686747},{"$f":"R3/'Pie Chart'!$O$31","v":44767118.473895587}]
["Bartholomew",1061,1050.5,1060.5,1036,1049.8,1018.9,1031,1051.4000000000001,1047,1053.2,1040.9000000000001,1062.8,12563,null,"Bartholomew",12563000,{"$f":"Q4/'Pie Chart'!$O$30","v":7568072.2891566269},{"$f":"R4/'Pie Chart'!$O$31","v":6306726.9076305227}]
["Benton",160.5,154.1,150.80000000000001,144.30000000000001,146,139,133.6,147.5,150.9,145.19999999999999,143.80000000000001,143.5,1759.2,null,"Benton",1759200,{"$f":"Q5/'Pie Chart'!$O$30","v":1059759.0361445784},{"$f":"R5/'Pie Chart'!$O$31","v":883132.53012048197}]
["Blackford",284.5,283.5,288.2,285.5,282.2,275.60000000000002,274,279.7,283.89999999999998,279.60000000000002,281.8,288.7,3387.2,null,"Blackford",3387200,{"$f":"Q6/'Pie Chart'!$O$30","v":2040481.9277108435},{"$f":"R6/'Pie Chart'!$O$31","v":1700401.606425703}]
["Boone",499.8,501,499.6,504.2,500.8,499.4,492.8,497.1,498.9,507.2,501.5,501.1,6003.4000000000005,null,"Boone",6003400.0000000009,{"$f":"Q7/'Pie Chart'!$O$30","v":3616506.0240963865},{"$f":"R7/'Pie Chart'!$O$31","v":3013755.0200803224}]
["Brown",198,203,203.3,196.9,205.2,201.2,199.7,207,207.3,206.4,208.4,204.5,2440.9,null,"Brown",2440900,{"$f":"Q8/'Pie Chart'!$O$30","v":1470421.686746988},{"$f":"R8/'Pie Chart'!$O$31","v":1225351.40562249}]
["Carroll",198.9,194.5,197.2,192.3,192.8,201.4,198.7,202.1,202.9,207.6,202.4,204.1,2394.8999999999996,null,"Carroll",2394899.9999999995,{"$f":"Q9/'Pie Chart'!$O$30","v":1442710.8433734938},{"$f":"R9/'Pie Chart'!$O$31","v":1202259.0361445781}]
["Cass",703,697.7,706.5,697.2,689.7,685.4,705.3,700,705.3,722.1,725.3,725,8462.5,null,"Cass",8462500,{"$f":"Q10/'Pie Chart'!$O$30","v":5097891.5662650606},{"$f":"R10/'Pie Chart'!$O$31","v":4248242.9718875503}]
["Clark",1669,1644.6,1870,1635.4,1647.1,1628.9,1642,1639.8,1616.5,1626.1,1619.3,1614.6,19853.299999999996,null,"Clark",19853299.999999996,{"$f":"Q11/'Pie Chart'!$O$30","v":11959819.277108433},{"$f":"R11/'Pie Chart'!$O$31","v":9966516.0642570276}]
["Clay",473.2,472.6,480.9,478.3,483.3,494.5,496.4,497.9,512.70000000000005,514.29999999999995,511,516.70000000000005,5931.8,null,"Clay",5931800,{"$f":"Q12/'Pie Chart'!$O$30","v":3573373.4939759038},{"$f":"R12/'Pie Chart'!$O$31","v":2977811.2449799199}]
["Clinton",622.4,624.6,611.4,623.5,619.4,611.79999999999995,622.70000000000005,622.5,614.29999999999995,623.20000000000005,615.1,620.29999999999995,7431.2000000000007,null,"Clinton",7431200.0000000009,{"$f":"Q13/'Pie Chart'!$O$30","v":4476626.5060240971},{"$f":"R13/'Pie Chart'!$O$31","v":3730522.0883534146}]
["Crawford",204.3,199.8,198.5,196.5,200.3,201.6,201,202,202.4,205.5,204.9,207.5,2424.3000000000002,null,"Crawford",2424300,{"$f":"Q14/'Pie Chart'!$O$30","v":1460421.686746988},{"$f":"R14/'Pie Chart'!$O$31","v":1217018.0722891567}]
["Daviess",428.3,425.4,418.9,419.7,427.2,424.8,436.1,442.7,444,437.5,441.4,442.2,5188.2,null,"Daviess",5188200,{"$f":"Q15/'Pie Chart'!$O$30","v":3125421.686746988},{"$f":"R15/'Pie Chart'!$O$31","v":2604518.0722891567}]
["Dearborn",653.79999999999995,652.9,659.6,661.7,664.3,670.5,685.2,694.3,693.7,700.8,690.8,701.4,8129,null,"Dearborn",8129000,{"$f":"Q16/'Pie Chart'!$O$30","v":4896987.9518072288},{"$f":"R16/'Pie Chart'!$O$31","v":4080823.293172691}]
["Decatur",435.9,430.7,426.9,430.4,429,417.5,427.5,428.8,431.4,431.5,421.5,420.2,5131.3,null,"Decatur",5131300,{"$f":"Q17/'Pie Chart'!$O$30","v":3091144.5783132534},{"$f":"R17/'Pie Chart'!$O$31","v":2575953.8152610445}]
["Dekalb",587.29999999999995,585.1,586.4,566.4,572.20000000000005,567.4,572.70000000000005,568,551.70000000000005,557.29999999999995,561,558.20000000000005,6833.7000000000007,null,"Dekalb",6833700.0000000009,{"$f":"Q18/'Pie Chart'!$O$30","v":4116686.7469879524},{"$f":"R18/'Pie Chart'!$O$31","v":3430572.2891566269}]
["Delaware",2614.1,2622,2642.3,2626.8,2673,2699,2701.8,2727.1,2719.6,2752.2,2740.1,2700.9,32218.899999999998,null,"Delaware",32218899.999999996,{"$f":"Q19/'Pie Chart'!$O$30","v":19408975.903614458},{"$f":"R19/'Pie Chart'!$O$31","v":16174146.586345382}]
["Dubois",287.89999999999998,291.89999999999998,294,289.39999999999998,285.2,283.2,283,280.3,274.39999999999998,281.3,272.5,265.3,3388.4000000000005,null,"Dubois",3388400.0000000005,{"$f":"Q20/'Pie Chart'!$O$30","v":2041204.8192771089},{"$f":"R20/'Pie Chart'!$O$31","v":1701004.0160642574}]
{"$rows_left_out":75}
{"sheet":"WIC","index":2,"n_rows":95,"n_cols":4,"rows_kept":95,"cut":false,"hidden":true,"merged":[]}
["COUNTYNAME","WIC 2012 $","Pounds","Meals"]
["ADAMS",462707.11,{"$f":"B2/'Pie Chart'!$O$30","v":278739.22289156629},{"$f":"C2/'Pie Chart'!$O$31","v":232282.68574297192}]
["ALLEN",7243490.8600000003,{"$f":"B3/'Pie Chart'!$O$30","v":4363548.710843374},{"$f":"C3/'Pie Chart'!$O$31","v":3636290.5923694787}]
["BARTHOLOMEW",1453459.48,{"$f":"B4/'Pie Chart'!$O$30","v":875578},{"$f":"C4/'Pie Chart'!$O$31","v":729648.33333333337}]
["BENTON",108950.31,{"$f":"B5/'Pie Chart'!$O$30","v":65632.716867469877},{"$f":"C5/'Pie Chart'!$O$31","v":54693.930722891564}]
["BLACKFORD",274190.12,{"$f":"B6/'Pie Chart'!$O$30","v":165174.77108433735},{"$f":"C6/'Pie Chart'!$O$31","v":137645.64257028114}]
["BOONE",436876.33,{"$f":"B7/'Pie Chart'!$O$30","v":263178.51204819279},{"$f":"C7/'Pie Chart'!$O$31","v":219315.42670682733}]
["BROWN",72481.64,{"$f":"B8/'Pie Chart'!$O$30","v":43663.638554216872},{"$f":"C8/'Pie Chart'!$O$31","v":36386.365461847396}]
["CARROLL",156141.53,{"$f":"B9/'Pie Chart'!$O$30","v":94061.162650602419},{"$f":"C9/'Pie Chart'!$O$31","v":78384.302208835346}]
["CASS",1055280.73,{"$f":"B10/'Pie Chart'!$O$30","v":635711.28313253017},{"$f":"C10/'Pie Chart'!$O$31","v":529759.40261044179}]
["CLARK",1845400.28,{"$f":"B11/'Pie Chart'!$O$30","v":1111686.9156626507},{"$f":"C11/'Pie Chart'!$O$31","v":926405.76305220893}]
["CLAY",544494.99,{"$f":"B12/'Pie Chart'!$O$30","v":328009.03012048191},{"$f":"C12/'Pie Chart'!$O$31","v":273340.85843373492}]
["CLINTON",772655.67,{"$f":"B13/'Pie Chart'!$O$30","v":465455.22289156629},{"$f":"C13/'Pie Chart'!$O$31","v":387879.35240963858}]
["CRAWFORD",137876.1,{"$f":"B14/'Pie Chart'!$O$30","v":83057.891566265069},{"$f":"C14/'Pie Chart'!$O$31","v":69214.909638554222}]
["DARKE",70596.639999999999,{"$f":"B15/'Pie Chart'!$O$30","v":42528.096385542172},{"$f":"C15/'Pie Chart'!$O$31","v":35440.080321285146}]
["DAVIESS",568444.76,{"$f":"B16/'Pie Chart'!$O$30","v":342436.60240963858},{"$f":"C16/'Pie Chart'!$O$31","v":285363.83534136548}]
["DEARBORN",686268.05,{"$f":"B17/'Pie Chart'!$O$30","v":413414.48795180727},{"$f":"C17/'Pie Chart'!$O$31","v":344512.07329317275}]
["DECATUR",473948.13,{"$f":"B18/'Pie Chart'!$O$30","v":285510.92168674699},{"$f":"C18/'Pie Chart'!$O$31","v":237925.76807228918}]
["DEKALB",643061.04,{"$f":"B19/'Pie Chart'!$O$30","v":387386.16867469886},{"$f":"C19/'Pie Chart'!$O$31","v":322821.80722891574}]
["DELAWARE",1939297.43,{"$f":"B20/'Pie Chart'!$O$30","v":1168251.4638554216},{"$f":"C20/'Pie Chart'!$O$31","v":973542.88654618477}]
{"$rows_left_out":76}
{"sheet":"School Meals","index":3,"n_rows":94,"n_cols":6,"rows_kept":94,"cut":false,"hidden":true,"merged":[]}
["CountyName","Sum of FreeBreakfasts","Sum of ReduLunches","Sum of FreeLunches","Sum of ReducedBreakfasts","Total Meals"]
["Adams",91895,64175,223900,14390,394360]
["Allen",1884833,720294,3985248,168509,6758884]
["Bartholomew",286112,125414,585378,46174,1043078]
["Benton",44094,25964,110643,6039,186740]
["Blackford",59838,24531,127291,4433,216093]
["Boone",138259,79187,294277,23370,535093]
["Brown",65678,39458,124199,17034,246369]
["Carroll",61644,44708,141440,11852,259644]
["Cass",152603,89649,444456,18427,705135]
["Clark",576009,232811,1066089,87891,1962800]
["Clay",140637,71022,267427,23141,502227]
["Clinton",164699,79965,436344,16261,697269]
["Crawford",79761,25193,116779,14880,236613]
["Daviess",116935,51267,271710,13217,453129]
["Dearborn",180671,75800,374018,19121,649610]
["Decatur",128237,65213,258724,18340,470514]
["DeKalb",160205,111000,384256,32090,687551]
["Delaware",572024,173694,1120595,46375,1912688]
["Dubois",133725,86815,266122,28779,515441]
{"$rows_left_out":75}
{"sheet":"Summer Meals","index":4,"n_rows":95,"n_cols":5,"rows_kept":95,"cut":false,"hidden":true,"merged":[]}
[]
["CountyNme","Sum of Breakfast","Sum of Lunch","Sum of SUPPER","Total Meals"]
["Adams",7849,17232,609,{"$f":"SUM(B3:D3)","v":25690}]
["Allen",33736,105373,24884,{"$f":"SUM(B4:D4)","v":163993}]
["Bartholomew",13580,26859,0,40439]
["Benton"]
["Blackford",2817,0,0,2817]
["Boone",2781,2961,0,5742]
["Brown",2374,1899,2376,6649]
["Carroll",0,805,0,805]
["Cass",574,774,0,1348]
["Clark",7468,20893,0,28361]
["Clay",2178,3448,97,5723]
["Clinton",5746,5570,0,11316]
["Crawford",3899,6137,0,10036]
["Daviess",0,4020,0,4020]
["Dearborn",0,892,0,892]
["Decatur",2848,7140,1154,11142]
["DeKalb",6734,25930,0,32664]
["Delaware",7990,20575,0,28565]
{"$rows_left_out":76}
{"sheet":"Feeding America Food Bank","index":5,"n_rows":94,"n_cols":9,"rows_kept":94,"cut":false,"hidden":true,"merged":[]}
["Food Bank  ","County","Total Pounds","Federal Pounds","Non Federal Pounds","TEFAP","CSFP","Federal Meals","Non-Federal Meals"]
["Community Harvest Food Bank of Northeast Indiana","ADAMS",413125,{"$f":"F2+G2","v":58050},{"$f":"C2-D2","v":355075},58050,null,{"$f":"D2/'Pie Chart'!$O$31","v":48375},{"$f":"E2/'Pie Chart'!$O$31","v":295895.83333333337}]
["Community Harvest Food Bank of Northeast Indiana","ALLEN",6322407,{"$f":"F3+G3","v":602948},5719459,602948,null,{"$f":"D3/'Pie Chart'!$O$31","v":502456.66666666669},{"$f":"E3/'Pie Chart'!$O$31","v":4766215.833333334}]
["Gleaners Food Bank","BARTHOLOMEW",406772,143398,263374,140658,2740,{"$f":"D4/'Pie Chart'!$O$31","v":119498.33333333334},{"$f":"E4/'Pie Chart'!$O$31","v":219478.33333333334}]
["Food Finders","BENTON",74755,13393,61362,13393,null,{"$f":"D5/'Pie Chart'!$O$31","v":11160.833333333334},{"$f":"E5/'Pie Chart'!$O$31","v":51135}]
["SH FB of East Central","BLACKFORD",386135,71272,314863,30176,41096,{"$f":"D6/'Pie Chart'!$O$31","v":59393.333333333336},{"$f":"E6/'Pie Chart'!$O$31","v":262385.83333333337}]
["Gleaners Food Bank","BOONE",348086,83025,265061,83025,null,{"$f":"D7/'Pie Chart'!$O$31","v":69187.5},{"$f":"E7/'Pie Chart'!$O$31","v":220884.16666666669}]
["Hoosier Hills Food Bank","BROWN",174133,27430,146703,27430,null,{"$f":"D8/'Pie Chart'!$O$31","v":22858.333333333336},{"$f":"E8/'Pie Chart'!$O$31","v":122252.5}]
["Food Finders","CARROLL",162740,29254,133486,29254,null,{"$f":"D9/'Pie Chart'!$O$31","v":24378.333333333336},{"$f":"E9/'Pie Chart'!$O$31","v":111238.33333333334}]
["Food Finders","CASS",394615,74873,319742,74873,null,{"$f":"D10/'Pie Chart'!$O$31","v":62394.166666666672},{"$f":"E10/'Pie Chart'!$O$31","v":266451.66666666669}]
["Dare To Care ( Louisville)","CLARK",1365610,214777,1150833,214777,null,{"$f":"D11/'Pie Chart'!$O$31","v":178980.83333333334},{"$f":"E11/'Pie Chart'!$O$31","v":959027.5}]
["Catholic Charities","CLAY",248200,58181,190019,58181,null,{"$f":"D12/'Pie Chart'!$O$31","v":48484.166666666672},{"$f":"E12/'Pie Chart'!$O$31","v":158349.16666666669}]
["Food Finders","CLINTON",227653,56591,171062,56591,null,{"$f":"D13/'Pie Chart'!$O$31","v":47159.166666666672},{"$f":"E13/'Pie Chart'!$O$31","v":142551.66666666669}]
["Dare To Care ( Louisville)","CRAWFORD",332586,134753,197833,30406,104347,{"$f":"D14/'Pie Chart'!$O$31","v":112294.16666666667},{"$f":"E14/'Pie Chart'!$O$31","v":164860.83333333334}]
["Tri State Food Bank","DAVIESS",344770,93617,251153,86792,6825,{"$f":"D15/'Pie Chart'!$O$31","v":78014.166666666672},{"$f":"E15/'Pie Chart'!$O$31","v":209294.16666666669}]
["Community Harvest Food Bank of Northeast Indiana","DE KALB",746149,56211,689938,56211,null,{"$f":"D16/'Pie Chart'!$O$31","v":46842.5},{"$f":"E16/'Pie Chart'!$O$31","v":574948.33333333337}]
["Freestore Food Bank","DEARBORN",488499,62926,425573,62926,null,{"$f":"D17/'Pie Chart'!$O$31","v":52438.333333333336},{"$f":"E17/'Pie Chart'!$O$31","v":354644.16666666669}]
["Gleaners Food Bank","DECATUR",246914,71066,175848,71066,null,{"$f":"D18/'Pie Chart'!$O$31","v":59221.666666666672},{"$f":"E18/'Pie Chart'!$O$31","v":146540}]
["SH FB of East Central","DELAWARE",1980009,328511,1651498,328511,null,{"$f":"D19/'Pie Chart'!$O$31","v":273759.16666666669},{"$f":"E19/'Pie Chart'!$O$31","v":1376248.3333333335}]
["Tri State Food Bank","DUBOIS",183685,77936,105749,77936,null,{"$f":"D20/'Pie Chart'!$O$31","v":64946.666666666672},{"$f":"E20/'Pie Chart'!$O$31","v":88124.166666666672}]
{"$rows_left_out":75}
{"sheet":"Other Sources","index":6,"n_rows":94,"n_cols":12,"rows_kept":94,"cut":false,"hidden":true,"merged":[]}
["County","Sum of Other Private Food Sources","Sum of Other Federal Food Sources","Midwest + Other Independent FB Pounds","Midwest FB Meals","Second Helpings Meals","Cicoa Meals","CICOA Fed","CICOA Meals Private","SVDP Meals","Meals on Wheels","Second Helpings Pounds to meals"]
["Adams",{"$f":"SUM(E2:L2)-G2-H2","v":0},{"$f":"H2","v":0},null,{"$f":"D2/'Pie Chart'!$O$31","v":0}]
["Allen",{"$f":"SUM(E3:L3)-G3-H3","v":954372.5},{"$f":"H3","v":0},{"$f":"14445+1130802","v":1145247},{"$f":"D3/'Pie Chart'!$O$31","v":954372.5}]
["Bartholomew",21812.5,0,26175,{"$f":"D4/'Pie Chart'!$O$31","v":21812.5}]
["Benton",0,0,null,{"$f":"D5/'Pie Chart'!$O$31","v":0}]
["Blackford",0,0,null,{"$f":"D6/'Pie Chart'!$O$31","v":0}]
["Boone",60114,6321,58230,{"$f":"D7/'Pie Chart'!$O$31","v":48525},{"$f":"'Second Helpings'!C5","v":8880},{"$f":"9030","v":9030},{"$f":"0.7*G7","v":6321},{"$f":"G7-H7","v":2709}]
["Brown",35129.1,592.9,41850,{"$f":"D8/'Pie Chart'!$O$31","v":34875},null,{"$f":"847","v":847},{"$f":"0.7*G8","v":592.9},{"$f":"G8-H8","v":254.10000000000002}]
["Carroll",22175,0,26610,{"$f":"D9/'Pie Chart'!$O$31","v":22175}]
["Cass",19685,0,23622,{"$f":"D10/'Pie Chart'!$O$31","v":19685}]
["Clark",0,0,null,{"$f":"D11/'Pie Chart'!$O$31","v":0}]
["Clay",17125,0,20550,{"$f":"D12/'Pie Chart'!$O$31","v":17125}]
["Clinton",30900,0,37080,{"$f":"D13/'Pie Chart'!$O$31","v":30900}]
["Crawford",17862.5,0,21435,{"$f":"D14/'Pie Chart'!$O$31","v":17862.5}]
["Daviess",12437.5,0,14925,{"$f":"D15/'Pie Chart'!$O$31","v":12437.5}]
["Dearborn",0,0,null,{"$f":"D16/'Pie Chart'!$O$31","v":0}]
["Decatur",0,0,null,{"$f":"D17/'Pie Chart'!$O$31","v":0}]
["Dekalb",0,0,null,{"$f":"D18/'Pie Chart'!$O$31","v":0}]
["Delaware",0,0,null,{"$f":"D19/'Pie Chart'!$O$31","v":0}]
["Dubois",0,0,null,{"$f":"D20/'Pie Chart'!$O$31","v":0}]
{"$rows_left_out":75}
{"sheet":"Second Helpings","index":7,"n_rows":7,"n_cols":7,"rows_kept":7,"cut":false,"hidden":true,"merged":[]}
[]
[null,"Second Helpings"]
[]
[null,null,"Boone","Hamilton","Johnson","Marion","Total"]
[null,"Meals",8880,13056,null,{"$f":"G5-D5-C5","v":706851},728787]
[null,"Lbs",null,21859,207901,{"$f":"G6-E6-D6","v":1100803},1330563]
[null,"Lbs to Meals",null,{"$f":"D6/'Pie Chart'!$O$31","v":18215.833333333336},{"$f":"E6/'Pie Chart'!$O$31","v":173250.83333333334},{"$f":"F6/'Pie Chart'!$O$31","v":917335.83333333337},{"$f":"SUM(D7:F7)","v":1108802.5}]

{"sheet":"Charitable Response","index":8,"n_rows":94,"n_cols":8,"rows_kept":94,"cut":false,"hidden":true,"merged":[[15,7,16,13],[21,7,21,13]]}
["County","% from non-food bank sources","Food Bank  ","Food Bank Pounds","Food Bank Meals","Charitable Response"]
["Adams",{"$f":"1-0.688","v":0.31200000000000006},"Community Harvest",{"$f":"'Feeding America Food Bank'!C2","v":413125},{"$f":"D2/'Pie Chart'!$O$31","v":344270.83333333337},{"$f":"E2*B2","v":107412.50000000003}]
["Allen",{"$f":"1-0.688","v":0.31200000000000006},"Community Harvest",{"$f":"'Feeding America Food Bank'!C3","v":6322407},{"$f":"D3/'Pie Chart'!$O$31","v":5268672.5},{"$f":"E3*B3","v":1643825.8200000003}]
["Bartholomew",{"$f":"1-0.615","v":0.38500000000000001},"Gleaners",{"$f":"'Feeding America Food Bank'!C4","v":406772},{"$f":"D4/'Pie Chart'!$O$31","v":338976.66666666669},{"$f":"E4*B4","v":130506.01666666668}]
["Benton",{"$f":"1-0.71","v":0.29000000000000004},"Food Finders",{"$f":"'Feeding America Food Bank'!C5","v":74755},{"$f":"D5/'Pie Chart'!$O$31","v":62295.833333333336},18065.791666666668]
["Blackford",{"$f":"1-0.626","v":0.374},"Second Harvest of East Central IN",{"$f":"'Feeding America Food Bank'!C6","v":386135},{"$f":"D6/'Pie Chart'!$O$31","v":321779.16666666669},120345.40833333334]
["Boone",{"$f":"1-0.615","v":0.38500000000000001},"Gleaners",{"$f":"'Feeding America Food Bank'!C7","v":348086},{"$f":"D7/'Pie Chart'!$O$31","v":290071.66666666669},111677.59166666667]
["Brown",{"$f":"1-0.705","v":0.29500000000000004},"Hoosier Hills",{"$f":"'Feeding America Food Bank'!C8","v":174133},{"$f":"D8/'Pie Chart'!$O$31","v":145110.83333333334},42807.695833333339]
["Carroll",{"$f":"1-0.71","v":0.29000000000000004},"Food Finders",{"$f":"'Feeding America Food Bank'!C9","v":162740},{"$f":"D9/'Pie Chart'!$O$31","v":135616.66666666669},39328.833333333343]
["Cass",0.29000000000000004,"Food Finders",{"$f":"'Feeding America Food Bank'!C10","v":394615},{"$f":"D10/'Pie Chart'!$O$31","v":328845.83333333337},95365.291666666686]
["Clark",{"$f":"1-0.848","v":0.15200000000000002},"Dare To Care",{"$f":"'Feeding America Food Bank'!C11","v":1365610},{"$f":"D11/'Pie Chart'!$O$31","v":1138008.3333333335},172977.26666666672]
["Clay",{"$f":"1-0.515","v":0.48499999999999999},"Terre Haute Catholic Charities",{"$f":"'Feeding America Food Bank'!C12","v":248200},{"$f":"D12/'Pie Chart'!$O$31","v":206833.33333333334},100314.16666666667]
["Clinton",{"$f":"1-0.71","v":0.29000000000000004},"Food Finders",{"$f":"'Feeding America Food Bank'!C13","v":227653},{"$f":"D13/'Pie Chart'!$O$31","v":189710.83333333334},55016.141666666677]
["Crawford",{"$f":"1-0.848","v":0.15200000000000002},"Dare To Care",{"$f":"'Feeding America Food Bank'!C14","v":332586},{"$f":"D14/'Pie Chart'!$O$31","v":277155},42127.560000000005]
["Daviess",{"$f":"1-0.641","v":0.35899999999999999},"Tri State",{"$f":"'Feeding America Food Bank'!C15","v":344770},{"$f":"D15/'Pie Chart'!$O$31","v":287308.33333333337},103143.69166666668]
["Dearborn",{"$f":"1-0.615","v":0.38500000000000001},"Freestone (Cincinatti) used Gleaners",{"$f":"'Feeding America Food Bank'!C16","v":746149},{"$f":"D16/'Pie Chart'!$O$31","v":621790.83333333337},239389.47083333335,null,"This information came from table 13.1.1 in the Hunger in America 2010 study for the Foodbank which serves the county."]
["Decatur",{"$f":"1-0.615","v":0.38500000000000001},"Gleaners",{"$f":"'Feeding America Food Bank'!C17","v":488499},{"$f":"D17/'Pie Chart'!$O$31","v":407082.5},156726.76250000001]
["Dekalb",{"$f":"1-0.688","v":0.31200000000000006},"Community Harvest",{"$f":"'Feeding America Food Bank'!C18","v":246914},{"$f":"D18/'Pie Chart'!$O$31","v":205761.66666666669},64197.640000000014]
["Delaware",{"$f":"1-0.626","v":0.374},"Second Harvest of East Central IN",{"$f":"'Feeding America Food Bank'!C19","v":1980009},{"$f":"D19/'Pie Chart'!$O$31","v":1650007.5},617102.80500000005]
["Dubois",{"$f":"1-0.641","v":0.35899999999999999},"Tri State",{"$f":"'Feeding America Food Bank'!C20","v":183685},{"$f":"D20/'Pie Chart'!$O$31","v":153070.83333333334},54952.429166666669]
{"$rows_left_out":74}